Reaction Details
TargetUncharacterized protein
LigandBDBM86243
Substrate/Competitorn/a
Ki 9200±n/a nM
CommentsPDSP_3078
Citation Vailati, SMoretti, MLonghi, RRovati, GEClementi, FGotti, C Developmental expression of heteromeric nicotinic receptor subtypes in chick retina. Mol Pharmacol63:1329-37 (2003) 
 
Uncharacterized protein
Name:Uncharacterized protein
Synonyms:Cholinergic, Nicotinic Alpha6Beta4
Type:Enzyme Catalytic Domain
Mol. Mass.:55323.77
Organism:Chick
Description:Cholinergic, Nicotinic Alpha6Beta4 0 Chick::F6Z813
Residue:486
BDBM86243
NameBDBM86243
TypeSmall organic molecule
Emp. Form.C22H30NO
Mol. Mass.324.4792
SMILESCC[N+](CC)(CC)CCOc1ccc(C=Cc2ccccc2)cc1