Reaction Details
TargetUncharacterized protein
LigandBDBM50004108
Substrate/Competitorn/a
Ki 98±n/a nM
CommentsPDSP_1311
Citation Vailati, SMoretti, MLonghi, RRovati, GEClementi, FGotti, C Developmental expression of heteromeric nicotinic receptor subtypes in chick retina. Mol Pharmacol63:1329-37 (2003) 
 
Uncharacterized protein
Name:Uncharacterized protein
Synonyms:Cholinergic, Nicotinic Alpha6Beta4
Type:Enzyme Catalytic Domain
Mol. Mass.:55323.77
Organism:Chick
Description:Cholinergic, Nicotinic Alpha6Beta4 0 Chick::F6Z813
Residue:486
BDBM50004108
NameBDBM50004108
TypeSmall organic molecule
Emp. Form.C10H14N2
Mol. Mass.162.2316
SMILESCN1CCCC1c1cccnc1