Reaction Details
TargetD(1B) dopamine receptor
LigandBDBM50130293
Substrate/Competitorn/a
Ki 2590±n/a nM
CommentsPDSP_3130
Citation Shapiro, DARenock, SArrington, EChiodo, LALiu, LXSibley, DRRoth, BLMailman, R Aripiprazole, a novel atypical antipsychotic drug with a unique and robust pharmacology. Neuropsychopharmacology28:1400-11 (2003) 
 
D(1B) dopamine receptor
Name:D(1B) dopamine receptor
Type:Protein
Mol. Mass.:52943.41
Organism:Homo sapiens (Human)
Description:P21918
Residue:477
BDBM50130293
NameBDBM50130293
Synonyms:7-{4-[4-(2,3-dichlorophenyl)piperazin-1-yl]butoxy}-3,4-dihydroquinolin-2(1H)-one CHEMBL1112 US10752588, Compound Aripiprazole US9018213, aripprazole | US9156822, Aripiprazole
TypeSmall organic molecule
Emp. Form.C23H27Cl2N3O2
Mol. Mass.448.385
SMILESClc1cccc(N2CCN(CCCCOc3ccc4CCC(=O)Nc4c3)CC2)c1Cl