Reaction Details
TargetDelta-type opioid receptor
LigandBDBM86258
Substrate/Competitorn/a
Ki 217±n/a nM
CommentsPDSP_1250
Citation Spetea, MTóth, FSchütz, JOtvös, FTóth, GBenyhe, SBorsodi, ASchmidhammer, H Binding characteristics of [3H]14-methoxymetopon, a high affinity mu-opioid receptor agonist. Eur J Neurosci18:290-5 (2003) 
 
Delta-type opioid receptor
Name:Delta-type opioid receptor
Type:G Protein-Coupled Receptor (GPCR)
Mol. Mass.:40465.04
Organism:Rattus norvegicus (rat)
Description:Competition binding assays were using CHO-K1 cell membranes expressing the opioid receptor.
Residue:372
BDBM86258
NameBDBM86258
Synonyms:CAS_23552-18-3 NSC_5980
TypeSmall organic molecule
Emp. Form.C17H19NO3
Mol. Mass.285.3377
SMILESCN1CCC23C4Oc5c2c(CC1C3C=CC4O)ccc5O