Reaction Details
TargetMu-type opioid receptor
LigandBDBM86257
Substrate/Competitorn/a
Ki 6.99±n/a nM
CommentsPDSP_781
Citation Spetea, MTóth, FSchütz, JOtvös, FTóth, GBenyhe, SBorsodi, ASchmidhammer, H Binding characteristics of [3H]14-methoxymetopon, a high affinity mu-opioid receptor agonist. Eur J Neurosci18:290-5 (2003) 
 
Mu-type opioid receptor
Name:Mu-type opioid receptor
Type:G Protein-Coupled Receptor (GPCR)
Mol. Mass.:44503.11
Organism:Rattus norvegicus (rat)
Description:Competition binding assays were carried out using membrane preparations from transfected HN9.10 cells that constitutively expressed the mu opioid receptor.
Residue:398
BDBM86257
NameBDBM86257
Synonyms:CAS_141801-26-5 NSC_5311081
TypeSmall organic molecule
Emp. Form.C32H37N5O5
Mol. Mass.571.6667
SMILESNC(Cc1ccc(O)cc1)C(=O)N1CCCC1C(=O)NC(Cc1ccccc1)C(=O)NC(Cc1ccccc1)C(N)=O