Reaction Details
TargetOxysterols receptor LXR-beta
LigandBDBM86263
Substrate/Competitorn/a
Ki 1100±n/a nM
CommentsPDSP_6976
Citation Bramlett, KSHouck, KABorchert, KMDowless, MSKulanthaivel, PZhang, YBeyer, TPSchmidt, RThomas, JSMichael, LFBarr, RMontrose, CEacho, PICao, GBurris, TP A natural product ligand of the oxysterol receptor, liver X receptor. J Pharmacol Exp Ther307:291-6 (2003) 
 
Oxysterols receptor LXR-beta
Name:Oxysterols receptor LXR-beta
Type:Enzyme Catalytic Domain
Mol. Mass.:50978.79
Organism:Homo sapiens (Human)
Description:P55055
Residue:460
BDBM86263
NameBDBM86263
Synonyms:CAS_57186-25-1 paxilline
TypeSmall organic molecule
Emp. Form.C27H33NO4
Mol. Mass.435.5552
SMILESCC(C)(O)C1OC2CCC3(C)C4(C)C(Cc5c4[nH]c4ccccc54)CCC3(O)C2=CC1=O