Reaction Details
TargetSolute carrier family 22 member 2
LigandBDBM86278
Substrate/Competitorn/a
Ki 3000±n/a nM
CommentsPDSP_4922
Citation Neumeyer, JLKula, NSBergman, JBaldessarini, RJ Receptor affinities of dopamine D1 receptor-selective novel phenylbenzazepines. Eur J Pharmacol474:137-40 (2003) 
 
Solute carrier family 22 member 2
Name:Solute carrier family 22 member 2
Type:Enzyme Catalytic Domain
Mol. Mass.:62348.38
Organism:RAT
Description:Adrenaline alpha2 0 RAT::Q9R0W2
Residue:555
BDBM86278
NameBDBM86278
Synonyms:MCL-202
TypeSmall organic molecule
Emp. Form.C18H20ClNO2
Mol. Mass.317.81
SMILESCN1CCc2c(Cl)c(O)c(O)cc2[C@@H](C1)c1cccc(C)c1