Reaction Details
TargetD(1A) dopamine receptor
LigandBDBM86278
Substrate/Competitorn/a
Ki 0.49±n/a nM
CommentsPDSP_4922
Citation Neumeyer, JLKula, NSBergman, JBaldessarini, RJ Receptor affinities of dopamine D1 receptor-selective novel phenylbenzazepines. Eur J Pharmacol474:137-40 (2003) 
 
D(1A) dopamine receptor
Name:D(1A) dopamine receptor
Type:Enzyme Catalytic Domain
Mol. Mass.:49429.75
Organism:RAT
Description:P18901
Residue:446
BDBM86278
NameBDBM86278
Synonyms:MCL-202
TypeSmall organic molecule
Emp. Form.C18H20ClNO2
Mol. Mass.317.81
SMILESCN1CCc2c(Cl)c(O)c(O)cc2[C@@H](C1)c1cccc(C)c1