Reaction Details
TargetD(1A) dopamine receptor
LigandBDBM50004923
Substrate/Competitorn/a
Ki 26.6±n/a nM
CommentsPDSP_1719
Citation Neumeyer, JLKula, NSBergman, JBaldessarini, RJ Receptor affinities of dopamine D1 receptor-selective novel phenylbenzazepines. Eur J Pharmacol474:137-40 (2003) 
 
D(1A) dopamine receptor
Name:D(1A) dopamine receptor
Type:Enzyme Catalytic Domain
Mol. Mass.:49429.75
Organism:RAT
Description:P18901
Residue:446
BDBM50004923
NameBDBM50004923
Synonyms:(+/-)-SKF-38393 1-Phenyl-2,3,4,5-tetrahydro-1H-benzo[d]azepine-7,8-diol (SK&F 38393) 1-Phenyl-2,3,4,5-tetrahydro-1H-benzo[d]azepine-7,8-diol; hydrochloride(SKF 38393) CHEMBL505308 RS(+/-)SKF 383931-Phenyl-2,3,4,5-tetrahydro-1H-benzo[d]azepine-7,8-diol SK-38393 SKF-38393 cid_147514
TypeSmall organic molecule
Emp. Form.C16H17NO2
Mol. Mass.255.3117
SMILESOc1cc2CCNCC(c3ccccc3)c2cc1O