Reaction Details
TargetD(2) dopamine receptor
LigandBDBM50004918
Substrate/Competitorn/a
Ki 1000±n/a nM
CommentsPDSP_1722
Citation Neumeyer, JLKula, NSBergman, JBaldessarini, RJ Receptor affinities of dopamine D1 receptor-selective novel phenylbenzazepines. Eur J Pharmacol474:137-40 (2003) 
 
D(2) dopamine receptor
Name:D(2) dopamine receptor
Type:G Protein-Coupled Receptor (GPCR)
Mol. Mass.:50931.60
Organism:Rattus norvegicus (rat)
Description:P61169
Residue:444
BDBM50004918
NameBDBM50004918
Synonyms:(+/-)-APD3-Allyl-1-phenyl-2,3,4,5-tetrahydro-1H-benzo[d]azepine-7,8-diol CHEMBL288090 SKF 77434
TypeSmall organic molecule
Emp. Form.C19H21NO2
Mol. Mass.295.3755
SMILESOc1cc2CCN(CC=C)CC(c3ccccc3)c2cc1O