Reaction Details
TargetSodium-dependent serotonin transporter
LigandBDBM50009057
Substrate/Competitorn/a
Ki 736±n/a nM
CommentsPDSP_1214
Citation Rothman, RBVu, NPartilla, JSRoth, BLHufeisen, SJCompton-Toth, BABirkes, JYoung, RGlennon, RA In vitro characterization of ephedrine-related stereoisomers at biogenic amine transporters and the receptorome reveals selective actions as norepinephrine transporter substrates. J Pharmacol Exp Ther307:138-45 (2003) 
 
Sodium-dependent serotonin transporter
Name:Sodium-dependent serotonin transporter
Type:Multi-pass membrane protein
Mol. Mass.:70322.51
Organism:Homo sapiens (Human)
Description:P31645
Residue:630
BDBM50009057
NameBDBM50009057
Synonyms:(R)Methyl-(1-methyl-2-phenyl-ethyl)-amine METHAMPHETAMINE (+) Methyl-(1-methyl-2-phenyl-ethyl)-amine | Methyl-(1-methyl-2-phenyl-ethyl)-amine(methamphetamine)
TypeSmall organic molecule
Emp. Form.C10H15N
Mol. Mass.149.2328
SMILESCNC(C)Cc1ccccc1