Reaction Details
TargetSodium-dependent dopamine transporter
LigandBDBM86285
Substrate/Competitorn/a
Ki 14.8±n/a nM
CommentsPDSP_3151
Citation Rothman, RBVu, NPartilla, JSRoth, BLHufeisen, SJCompton-Toth, BABirkes, JYoung, RGlennon, RA In vitro characterization of ephedrine-related stereoisomers at biogenic amine transporters and the receptorome reveals selective actions as norepinephrine transporter substrates. J Pharmacol Exp Ther307:138-45 (2003) 
 
Sodium-dependent dopamine transporter
Name:Sodium-dependent dopamine transporter
Type:Multi-pass membrane protein
Mol. Mass.:68497.11
Organism:Homo sapiens (Human)
Description:Q01959
Residue:620
BDBM86285
NameBDBM86285
Synonyms:CAS_1576 NSC_1576
TypeSmall organic molecule
Emp. Form.C10H13NO
Mol. Mass.163.2163
SMILESCNC(C)C(=O)c1ccccc1