Reaction Details
TargetNon-receptor tyrosine-protein kinase TYK2
LigandBDBM277493
Substrate/Competitorn/a
Meas. Tech.Biochemical JAK Assay
pH7.5±n/a
Ki 0.55±n/a nM
Commentsextracted
Citation Huang, XThalladi, VR Crystalline form of 3-((1R,3s,5S)-3-((7-((5-methyl-1H-pyrazol-3-yl)amino)-1,6-naphthyridin-5-yl)amino)-8-azabicyclo[3.2.1]octan-8-yl)propanenitrile US Patent US10072026 Publication Date 9/11/2018
 
Non-receptor tyrosine-protein kinase TYK2
Name:Non-receptor tyrosine-protein kinase TYK2
Type:Protein
Mol. Mass.:133666.03
Organism:Homo sapiens (Human)
Description:P29597
Residue:1187
BDBM277493
NameBDBM277493
Synonyms:US10072026, Example 2-29 | US10947254, Example 2-29
TypeSmall organic molecule
Emp. Form.C25H30N8O
Mol. Mass.458.5587
SMILESCC(CC#N)C(=O)N1[C@H]2CCC[C@@H]1C[C@H](C2)Nc1nc(Nc2cc(C)[nH]n2)cc2ncccc12