Reaction Details
TargetMuscarinic acetylcholine receptor M3
LigandBDBM86293
Substrate/Competitorn/a
Ki 16.98±n/a nM
CommentsPDSP_3136
Citation De Amici, MConti, PFasoli, EBarocelli, EBallabeni, VBertoni, SImpicciatore, MRoth, BLErnsberger, PDe Micheli, C Synthesis and in vitro pharmacology of novel heterocyclic muscarinic ligands. Farmaco58:739-48 (2003) 
 
Muscarinic acetylcholine receptor M3
Name:Muscarinic acetylcholine receptor M3
Type:Enzyme
Mol. Mass.:66151.03
Organism:Homo sapiens (Human)
Description:P20309
Residue:590
BDBM86293
NameBDBM86293
Synonyms:3-[4-(2-Methyl-3-(4-bromobenzyl)-1H-imidazolium-1-yl)-2-butynyl]oxyisoxazole bromide NSC_0
TypeSmall organic molecule
Emp. Form.C17H15BrN3O2
Mol. Mass.373.223
SMILESCc1n(CC#CCOc2ccon2)cc[n+]1-c1ccc(Br)cc1