Reaction Details
TargetfMet-Leu-Phe receptor
LigandBDBM86299
Substrate/Competitorn/a
Ki 32±n/a nM
CommentsPDSP_3272
Citation Bae, YSSong, JYKim, YHe, RYe, RDKwak, JYSuh, PGRyu, SH Differential activation of formyl peptide receptor signaling by peptide ligands. Mol Pharmacol64:841-7 (2003) 
 
fMet-Leu-Phe receptor
Name:fMet-Leu-Phe receptor
Type:Enzyme Catalytic Domain
Mol. Mass.:38456.14
Organism:Homo sapiens (Human)
Description:gi_4503779
Residue:350
BDBM86299
NameBDBM86299
Synonyms:WHYMVm-NH2
TypeSmall organic molecule
Emp. Form.C41H56N10O7S2
Mol. Mass.865.076
SMILESCSCC[C@@H](NC(=O)[C@@H](NC(=O)[C@H](CCSC)NC(=O)[C@H](Cc1ccc(O)cc1)NC(=O)[C@@H](Cc1cnc[nH]1)NC(=O)[C@@H](N)Cc1c[nH]c2ccccc12)C(C)C)C(N)=O