Reaction Details
TargetMuscarinic acetylcholine receptor M2
LigandBDBM86310
Substrate/Competitorn/a
Ki>10000±n/a nM
CommentsPDSP_3402
Citation Jensen, AAMikkelsen, IFrølund, BBräuner-Osborne, HFalch, EKrogsgaard-Larsen, P Carbamoylcholine homologs: novel and potent agonists at neuronal nicotinic acetylcholine receptors. Mol Pharmacol64:865-75 (2003) 
 
Muscarinic acetylcholine receptor M2
Name:Muscarinic acetylcholine receptor M2
Type:Enzyme Catalytic Domain
Mol. Mass.:51555.53
Organism:RAT
Description:P10980
Residue:466
BDBM86310
NameBDBM86310
Synonyms:DMCAE
TypeSmall organic molecule
Emp. Form.C7H16N2O2
Mol. Mass.160.2141
SMILESCN(C)CCOC(=O)N(C)C