Reaction Details
TargetMuscarinic acetylcholine receptor M2
LigandBDBM85224
Substrate/Competitorn/a
Ki 150±n/a nM
CommentsPDSP_1165
Citation Jensen, AAMikkelsen, IFrølund, BBräuner-Osborne, HFalch, EKrogsgaard-Larsen, P Carbamoylcholine homologs: novel and potent agonists at neuronal nicotinic acetylcholine receptors. Mol Pharmacol64:865-75 (2003) 
 
Muscarinic acetylcholine receptor M2
Name:Muscarinic acetylcholine receptor M2
Type:Enzyme Catalytic Domain
Mol. Mass.:51555.53
Organism:RAT
Description:P10980
Residue:466
BDBM85224
NameBDBM85224
Synonyms:CAS_1918-18-9 SWEP
TypeSmall organic molecule
Emp. Form.C8H7Cl2NO2
Mol. Mass.220.053
SMILESCOC(=O)Nc1ccc(Cl)c(Cl)c1