Reaction Details
TargetNeuronal acetylcholine receptor subunit alpha-3
LigandBDBM86311
Substrate/Competitorn/a
Ki 130±n/a nM
CommentsPDSP_609
Citation Jensen, AAMikkelsen, IFrølund, BBräuner-Osborne, HFalch, EKrogsgaard-Larsen, P Carbamoylcholine homologs: novel and potent agonists at neuronal nicotinic acetylcholine receptors. Mol Pharmacol64:865-75 (2003) 
 
Neuronal acetylcholine receptor subunit alpha-3
Name:Neuronal acetylcholine receptor subunit alpha-3
Type:Enzyme
Mol. Mass.:56995.52
Organism:Rattus norvegicus (Rat)
Description:P04757
Residue:499
BDBM86311
NameBDBM86311
Synonyms:CAS_485-35-8 Cytisine-(-) US11667638, Example Cytisine
TypeSmall organic molecule
Emp. Form.C11H14N2O
Mol. Mass.190.2417
SMILESO=c1cccc2C3CNCC(C3)Cn12