Reaction Details
TargetNeuronal acetylcholine receptor subunit alpha-7
LigandBDBM50275262
Substrate/Competitorn/a
Ki>10000±n/a nM
CommentsPDSP_3403
Citation Jensen, AAMikkelsen, IFrølund, BBräuner-Osborne, HFalch, EKrogsgaard-Larsen, P Carbamoylcholine homologs: novel and potent agonists at neuronal nicotinic acetylcholine receptors. Mol Pharmacol64:865-75 (2003) 
 
Neuronal acetylcholine receptor subunit alpha-7
Name:Neuronal acetylcholine receptor subunit alpha-7
Type:Enzyme
Mol. Mass.:56502.44
Organism:Rattus norvegicus (Rat)
Description:Q05941
Residue:502
BDBM50275262
NameBDBM50275262
Synonyms:3-(dimethylamino)butyl dimethylcarbamate CHEMBL486572
TypeSmall organic molecule
Emp. Form.C9H20N2O2
Mol. Mass.188.2673
SMILESCC(CCOC(=O)N(C)C)N(C)C