Reaction Details
TargetNeuronal acetylcholine receptor subunit alpha-7
LigandBDBM85224
Substrate/Competitorn/a
Ki>10000±n/a nM
CommentsPDSP_1165
Citation Jensen, AAMikkelsen, IFrølund, BBräuner-Osborne, HFalch, EKrogsgaard-Larsen, P Carbamoylcholine homologs: novel and potent agonists at neuronal nicotinic acetylcholine receptors. Mol Pharmacol64:865-75 (2003) 
 
Neuronal acetylcholine receptor subunit alpha-7
Name:Neuronal acetylcholine receptor subunit alpha-7
Type:Enzyme
Mol. Mass.:56502.44
Organism:Rattus norvegicus (Rat)
Description:Q05941
Residue:502
BDBM85224
NameBDBM85224
Synonyms:CAS_1918-18-9 SWEP
TypeSmall organic molecule
Emp. Form.C8H7Cl2NO2
Mol. Mass.220.053
SMILESCOC(=O)Nc1ccc(Cl)c(Cl)c1