Reaction Details
TargetNicotinic acetylcholine receptor
LigandBDBM50275262
Substrate/Competitorn/a
Ki 9±n/a nM
CommentsPDSP_3403
Citation Jensen, AAMikkelsen, IFrølund, BBräuner-Osborne, HFalch, EKrogsgaard-Larsen, P Carbamoylcholine homologs: novel and potent agonists at neuronal nicotinic acetylcholine receptors. Mol Pharmacol64:865-75 (2003) 
 
Nicotinic acetylcholine receptor
Name:Nicotinic acetylcholine receptor
Type:Enzyme Catalytic Domain
Mol. Mass.:2478.99
Organism:RAT
Description:n-AChR 0 RAT::Q62594
Residue:23
BDBM50275262
NameBDBM50275262
Synonyms:3-(dimethylamino)butyl dimethylcarbamate CHEMBL486572
TypeSmall organic molecule
Emp. Form.C9H20N2O2
Mol. Mass.188.2673
SMILESCC(CCOC(=O)N(C)C)N(C)C