Reaction Details
TargetNicotinic acetylcholine receptor
LigandBDBM86310
Substrate/Competitorn/a
Ki 5700±n/a nM
CommentsPDSP_3402
Citation Jensen, AAMikkelsen, IFrølund, BBräuner-Osborne, HFalch, EKrogsgaard-Larsen, P Carbamoylcholine homologs: novel and potent agonists at neuronal nicotinic acetylcholine receptors. Mol Pharmacol64:865-75 (2003) 
 
Nicotinic acetylcholine receptor
Name:Nicotinic acetylcholine receptor
Type:Enzyme Catalytic Domain
Mol. Mass.:2478.99
Organism:RAT
Description:n-AChR 0 RAT::Q62594
Residue:23
BDBM86310
NameBDBM86310
Synonyms:DMCAE
TypeSmall organic molecule
Emp. Form.C7H16N2O2
Mol. Mass.160.2141
SMILESCN(C)CCOC(=O)N(C)C