Reaction Details
TargetNicotinic acetylcholine receptor
LigandBDBM85224
Substrate/Competitorn/a
Ki 23±n/a nM
CommentsPDSP_1165
Citation Jensen, AAMikkelsen, IFrølund, BBräuner-Osborne, HFalch, EKrogsgaard-Larsen, P Carbamoylcholine homologs: novel and potent agonists at neuronal nicotinic acetylcholine receptors. Mol Pharmacol64:865-75 (2003) 
 
Nicotinic acetylcholine receptor
Name:Nicotinic acetylcholine receptor
Type:Enzyme Catalytic Domain
Mol. Mass.:2478.99
Organism:RAT
Description:n-AChR 0 RAT::Q62594
Residue:23
BDBM85224
NameBDBM85224
Synonyms:CAS_1918-18-9 SWEP
TypeSmall organic molecule
Emp. Form.C8H7Cl2NO2
Mol. Mass.220.053
SMILESCOC(=O)Nc1ccc(Cl)c(Cl)c1