Reaction Details
TargetPromotilin
LigandBDBM50143037
Substrate/Competitorn/a
Ki 0.98±n/a nM
CommentsPDSP_6064
Citation Dass, NBHill, JMuir, ATesta, TWise, ASanger, GJ The rabbit motilin receptor: molecular characterisation and pharmacology. Br J Pharmacol140:948-54 (2003) 
 
Promotilin
Name:Promotilin
Type:Enzyme Catalytic Domain
Mol. Mass.:14668.99
Organism:RABBIT
Description:Motilin 0 RABBIT::P27114
Residue:133
BDBM50143037
NameBDBM50143037
Synonyms:CHEMBL411576 | MOTILIN
TypeSmall organic molecule
Emp. Form.C120H188N34O35S
Mol. Mass.2699.049
SMILESCCC(C)C(NC(=O)C1CCCN1C(=O)C(NC(=O)C(N)Cc1ccccc1)C(C)C)C(=O)NC(Cc1ccccc1)C(=O)NC(C(C)O)C(=O)NC(Cc1ccc(O)cc1)C(=O)NCC(=O)NC(CCC(O)=O)C(=O)NC(CC(C)C)C(=O)NC(CCC(N)=O)C(=O)NC(CCCNC(N)=N)C(=O)NC(CCSC)C(=O)NC(CCC(N)=O)C(=O)NC(CCC(O)=O)C(=O)NC(CCCCN)C(=O)NC(CCC(O)=O)C(=O)NC(CCCNC(N)=N)C(=O)NC(CC(N)=O)C(=O)NC(CCCCN)C(=O)NCC(=O)NC(CCC(N)=O)C(O)=O