Reaction Details
TargetSerine/threonine-protein kinase PLK1
LigandBDBM86339
Substrate/Competitorn/a
Meas. Tech.Inhibition Assay
pH8±0
Temperature298.15±0 K
IC50 55±n/a nM
Citation Liu, FPark, JEQian, WJLim, DGräber, MBerg, TYaffe, MBLee, KSBurke, TR Serendipitous alkylation of a Plk1 ligand uncovers a new binding channel. Nat Chem Biol7:595-601 (2011) 
 
Serine/threonine-protein kinase PLK1
Name:Serine/threonine-protein kinase PLK1
Type:Serine/threonine-protein kinase
Mol. Mass.:68277.16
Organism:Homo sapiens (Human)
Description:P53350
Residue:603
BDBM86339
NameBDBM86339
Synonyms:Phosphodiester analog, 4h
TypePeptide
Emp. Form.C38H59N8O11P
Mol. Mass.834.8958
SMILESCC(C)C[C@H](NC(=O)C1CCCN1C(C)=O)C(=O)N[C@@H](Cc1cncn1CCCCCCc1ccccc1)C(=O)N[C@@H](CO)C(=O)N[C@@H]([C@@H](C)OP(O)(O)=O)C(N)=O