Reaction Details
TargetSodium-dependent noradrenaline transporter
LigandBDBM35229
Substrate/Competitorn/a
Ki 3.8±n/a nM
CommentsPDSP_638
Citation Koch, SHemrick-Luecke, SKThompson, LKEvans, DCThrelkeld, PGNelson, DLPerry, KWBymaster, FP Comparison of effects of dual transporter inhibitors on monoamine transporters and extracellular levels in rats. Neuropharmacology45:935-44 (2003) 
 
Sodium-dependent noradrenaline transporter
Name:Sodium-dependent noradrenaline transporter
Type:Multi-pass membrane protein
Mol. Mass.:69337.72
Organism:Homo sapiens (Human)
Description:P23975
Residue:617
BDBM35229
NameBDBM35229
Synonyms:3-(10,11-dihydro-5H-dibenzo[b,f]azepin-5-yl)-N-methylpropan-1-amine CHEMBL72 DMI Desipramine N-(3-methylaminopropyl)iminobibenzyl demethylimipramine norimipramine
TypeSmall organic molecule
Emp. Form.C18H22N2
Mol. Mass.266.3807
SMILESCNCCCN1c2ccccc2CCc2ccccc12