Reaction Details
TargetSodium-dependent noradrenaline transporter
LigandBDBM50136680
Substrate/Competitorn/a
Ki 7.5±n/a nM
CommentsPDSP_763
Citation Koch, SHemrick-Luecke, SKThompson, LKEvans, DCThrelkeld, PGNelson, DLPerry, KWBymaster, FP Comparison of effects of dual transporter inhibitors on monoamine transporters and extracellular levels in rats. Neuropharmacology45:935-44 (2003) 
 
Sodium-dependent noradrenaline transporter
Name:Sodium-dependent noradrenaline transporter
Type:Multi-pass membrane protein
Mol. Mass.:69337.72
Organism:Homo sapiens (Human)
Description:P23975
Residue:617
BDBM50136680
NameBDBM50136680
Synonyms:CHEMBL424660 N-methyl-3-(naphthalen-1-yloxy)-3-(2-thienyl)propan-1-amine | duloxetine
TypeSmall organic molecule
Emp. Form.C18H19NOS
Mol. Mass.297.415
SMILESCNCCC(Oc1cccc2ccccc12)c1cccs1