Reaction Details
TargetMuscarinic acetylcholine receptor M2
LigandBDBM86231
Substrate/Competitorn/a
Ki 1.5±n/a nM
CommentsPDSP_334
Citation Bymaster, FPFelder, CCTzavara, ENomikos, GGCalligaro, DOMckinzie, DL Muscarinic mechanisms of antipsychotic atypicality. Prog Neuropsychopharmacol Biol Psychiatry27:1125-43 (2003) 
 
Muscarinic acetylcholine receptor M2
Name:Muscarinic acetylcholine receptor M2
Type:GPCR
Mol. Mass.:51730.61
Organism:Homo sapiens (Human)
Description:P08172
Residue:466
BDBM86231
NameBDBM86231
Synonyms:ATR Atropine,(-) CHEMBL195 US9333195, ATROPINE
TypeSmall organic molecule
Emp. Form.C17H23NO3
Mol. Mass.289.3694
SMILESCN1C2CCC1CC(C2)OC(=O)C(CO)c1ccccc1