Reaction Details
TargetMuscarinic acetylcholine receptor M2
LigandBDBM82479
Substrate/Competitorn/a
Ki 96±n/a nM
CommentsPDSP_1408
Citation Bymaster, FPFelder, CCTzavara, ENomikos, GGCalligaro, DOMckinzie, DL Muscarinic mechanisms of antipsychotic atypicality. Prog Neuropsychopharmacol Biol Psychiatry27:1125-43 (2003) 
 
Muscarinic acetylcholine receptor M2
Name:Muscarinic acetylcholine receptor M2
Type:GPCR
Mol. Mass.:51730.61
Organism:Homo sapiens (Human)
Description:P08172
Residue:466
BDBM82479
NameBDBM82479
Synonyms:CAS_132539-06-1 OLANZAPINE | USRE49340, Rank 2
TypeSmall organic molecule
Emp. Form.C17H20N4S
Mol. Mass.312.432
SMILESCN1CCN(CC1)C1=c2cc(C)sc2=Nc2ccccc2N1