Reaction Details
Target5-hydroxytryptamine receptor 6
LigandBDBM82087
Substrate/Competitorn/a
Ki 23.44±n/a nM
CommentsPDSP_172
Citation Hirst, WDAbrahamsen, BBlaney, FECalver, ARAloj, LPrice, GWMedhurst, AD Differences in the central nervous system distribution and pharmacology of the mouse 5-hydroxytryptamine-6 receptor compared with rat and human receptors investigated by radioligand binding, site-directed mutagenesis, and molecular modeling. Mol Pharmacol64:1295-308 (2003) 
 
5-hydroxytryptamine receptor 6
Name:5-hydroxytryptamine receptor 6
Type:Enzyme Catalytic Domain
Mol. Mass.:47012.98
Organism:MOUSE
Description:5-HT6 HTR6 MOUSE::Q9R1C8
Residue:440
BDBM82087
NameBDBM82087
Synonyms:2-(5-methoxy-1H-indol-3-yl)ethanamine 5-Methoxytryptamine hydrochloride tryptamine, 5-Methoxy
TypeSmall organic molecule
Emp. Form.C11H14N2O
Mol. Mass.190.2417
SMILESCOc1ccc2[nH]cc(CCN)c2c1