Reaction Details
Target5-hydroxytryptamine receptor 6
LigandBDBM50073056
Substrate/Competitorn/a
Ki 22.91±n/a nM
CommentsPDSP_3219
Citation Hirst, WDAbrahamsen, BBlaney, FECalver, ARAloj, LPrice, GWMedhurst, AD Differences in the central nervous system distribution and pharmacology of the mouse 5-hydroxytryptamine-6 receptor compared with rat and human receptors investigated by radioligand binding, site-directed mutagenesis, and molecular modeling. Mol Pharmacol64:1295-308 (2003) 
 
5-hydroxytryptamine receptor 6
Name:5-hydroxytryptamine receptor 6
Type:Enzyme Catalytic Domain
Mol. Mass.:47012.98
Organism:MOUSE
Description:5-HT6 HTR6 MOUSE::Q9R1C8
Residue:440
BDBM50073056
NameBDBM50073056
Synonyms:4-Bromo-N-[4-methoxy-3-(4-methyl-piperazin-1-yl)-phenyl]-benzenesulfonamide SB-214111
TypeSmall organic molecule
Emp. Form.C18H22BrN3O3S
Mol. Mass.440.355
SMILESCOc1ccc(NS(=O)(=O)c2ccc(Br)cc2)cc1N1CCN(C)CC1