Reaction Details
TargetProtein kinase C alpha type
LigandBDBM86433
Substrate/Competitorn/a
Ki 4.83±n/a nM
CommentsPDSP_3225
Citation Wang, QJFang, TWYang, DLewin, NEVan Lint, JMarquez, VEBlumberg, PM Ligand structure-activity requirements and phospholipid dependence for the binding of phorbol esters to protein kinase D. Mol Pharmacol64:1342-8 (2003) 
 
Protein kinase C alpha type
Name:Protein kinase C alpha type
Type:Enzyme
Mol. Mass.:76755.65
Organism:Homo sapiens (Human)
Description:The recombinant human PKC enzymes were produced using a baculovirus expression system in SF9 cells
Residue:672
BDBM86433
NameBDBM86433
Synonyms:CAS_454217 Prostratin
TypeSmall organic molecule
Emp. Form.C22H30O6
Mol. Mass.390.47
SMILESCC1CC2(OC(C)=O)C(C3C=C(CO)CC4(O)C(C=C(C)C4=O)C13O)C2(C)C