Reaction Details
TargetProtein kinase C delta type
LigandBDBM86429
Substrate/Competitorn/a
Ki 10.7±n/a nM
CommentsPDSP_3224
Citation Wang, QJFang, TWYang, DLewin, NEVan Lint, JMarquez, VEBlumberg, PM Ligand structure-activity requirements and phospholipid dependence for the binding of phorbol esters to protein kinase D. Mol Pharmacol64:1342-8 (2003) 
 
Protein kinase C delta type
Name:Protein kinase C delta type
Type:Enzyme
Mol. Mass.:77516.79
Organism:Homo sapiens (Human)
Description:The recombinant human PKC enzymes were produced using a baculovirus expression system in SF9 cells
Residue:676
BDBM86429
NameBDBM86429
Synonyms:CAS_6437389 Thymeleatoxin | Thymeleatoxin (low PS)
TypeSmall organic molecule
Emp. Form.C36H36O10
Mol. Mass.628.665
SMILESCC1C(OC(=O)C=Cc2ccccc2)C2(OC3(OC2C2C4OC4(CO)C(O)C4(O)C(C=C(C)C4=O)C12O3)c1ccccc1)C(C)=C