Reaction Details
TargetPolycystin-1
LigandBDBM86430
Substrate/Competitorn/a
Ki 38±n/a nM
CommentsPDSP_3227
Citation Wang, QJFang, TWYang, DLewin, NEVan Lint, JMarquez, VEBlumberg, PM Ligand structure-activity requirements and phospholipid dependence for the binding of phorbol esters to protein kinase D. Mol Pharmacol64:1342-8 (2003) 
 
Polycystin-1
Name:Polycystin-1
Type:Enzyme Catalytic Domain
Mol. Mass.:462537.85
Organism:Homo sapiens (Human)
Description:Protein Kinase D-GST 0 HUMAN::P98161
Residue:4303
BDBM86430
NameBDBM86430
Synonyms:(-)-Indolactam V CAS_105000 | NSC_105000
TypeSmall organic molecule
Emp. Form.C17H23N3O2
Mol. Mass.301.3834
SMILESCC(C)C1N(C)c2cccc3[nH]cc(CC(CO)NC1=O)c23