Reaction Details
TargetPolycystin-1
LigandBDBM86436
Substrate/Competitorn/a
Ki 90±n/a nM
CommentsPDSP_3233
Citation Wang, QJFang, TWYang, DLewin, NEVan Lint, JMarquez, VEBlumberg, PM Ligand structure-activity requirements and phospholipid dependence for the binding of phorbol esters to protein kinase D. Mol Pharmacol64:1342-8 (2003) 
 
Polycystin-1
Name:Polycystin-1
Type:Enzyme Catalytic Domain
Mol. Mass.:462537.85
Organism:Homo sapiens (Human)
Description:Protein Kinase D-GST 0 HUMAN::P98161
Residue:4303
BDBM86436
NameBDBM86436
Synonyms:3-hydroxy-2-[4-methyl-3-(methylethyl)pentanoyloxy]propyl 4-methyl-3-(methylethyl)pentanoate | 97D76
TypeSmall organic molecule
Emp. Form.C21H42O4
Mol. Mass.358.5558
SMILESCCC(C)(CCOC(CO)COC(=O)CC(C)(CC)C(C)C)C(C)C