Reaction Details
TargetPolycystin-1
LigandBDBM86440
Substrate/Competitorn/a
Ki 146±n/a nM
CommentsPDSP_3230
Citation Wang, QJFang, TWYang, DLewin, NEVan Lint, JMarquez, VEBlumberg, PM Ligand structure-activity requirements and phospholipid dependence for the binding of phorbol esters to protein kinase D. Mol Pharmacol64:1342-8 (2003) 
 
Polycystin-1
Name:Polycystin-1
Type:Enzyme Catalytic Domain
Mol. Mass.:462537.85
Organism:Homo sapiens (Human)
Description:Protein Kinase D-GST 0 HUMAN::P98161
Residue:4303
BDBM86440
NameBDBM86440
Synonyms:CAS_104731 OAG
TypeSmall organic molecule
Emp. Form.C23H42O5
Mol. Mass.398.5766
SMILESCCCCCCCCC=CCCCCCCCC(=O)OCC(CO)OC(C)=O