Reaction Details
TargetPolycystin-1
LigandBDBM86433
Substrate/Competitorn/a
Ki 12.9±n/a nM
CommentsPDSP_3225
Citation Wang, QJFang, TWYang, DLewin, NEVan Lint, JMarquez, VEBlumberg, PM Ligand structure-activity requirements and phospholipid dependence for the binding of phorbol esters to protein kinase D. Mol Pharmacol64:1342-8 (2003) 
 
Polycystin-1
Name:Polycystin-1
Type:Enzyme Catalytic Domain
Mol. Mass.:462537.85
Organism:Homo sapiens (Human)
Description:Protein Kinase D-GST 0 HUMAN::P98161
Residue:4303
BDBM86433
NameBDBM86433
Synonyms:CAS_454217 Prostratin
TypeSmall organic molecule
Emp. Form.C22H30O6
Mol. Mass.390.47
SMILESCC1CC2(OC(C)=O)C(C3C=C(CO)CC4(O)C(C=C(C)C4=O)C13O)C2(C)C