Reaction Details
TargetDelta-type opioid receptor
LigandBDBM86443
Substrate/Competitorn/a
Ki 1.03±n/a nM
CommentsPDSP_4500
Citation Spetea, MFriedmann, TRiba, PSchütz, JWunder, GLanger, TSchmidhammer, HFürst, S In vitro opioid activity profiles of 6-amino acid substituted derivatives of 14-O-methyloxymorphone. Eur J Pharmacol483:301-8 (2004) 
 
Delta-type opioid receptor
Name:Delta-type opioid receptor
Type:G Protein-Coupled Receptor (GPCR)
Mol. Mass.:40465.04
Organism:Rattus norvegicus (rat)
Description:Competition binding assays were using CHO-K1 cell membranes expressing the opioid receptor.
Residue:372
BDBM86443
NameBDBM86443
Synonyms:(2S)-2-[(4,5alpha-epoxy-3-hydroxy-14beta-methoxy-17-methylmorphinan-6beta-yl)amino]-3-phenylpropanoic acid bis(tetrafluoroborate)
TypeSmall organic molecule
Emp. Form.C27H32N2O5
Mol. Mass.464.5534
SMILESCOC12CC[C@@H](N[C@H](Cc3ccccc3)C(O)=O)[C@@H]3Oc4c5c(CC1N(C)CC[C@@]235)ccc4O