Reaction Details
TargetDelta-type opioid receptor
LigandBDBM86442
Substrate/Competitorn/a
Ki 7.86±n/a nM
CommentsPDSP_4496
Citation Spetea, MFriedmann, TRiba, PSchütz, JWunder, GLanger, TSchmidhammer, HFürst, S In vitro opioid activity profiles of 6-amino acid substituted derivatives of 14-O-methyloxymorphone. Eur J Pharmacol483:301-8 (2004) 
 
Delta-type opioid receptor
Name:Delta-type opioid receptor
Type:G Protein-Coupled Receptor (GPCR)
Mol. Mass.:40465.04
Organism:Rattus norvegicus (rat)
Description:Competition binding assays were using CHO-K1 cell membranes expressing the opioid receptor.
Residue:372
BDBM86442
NameBDBM86442
Synonyms:2-[(4,5alpha-epoxy-3-hydroxy-14beta-methoxy-17-methylmorphinan-6beta-yl)amino]acetic acid bis(tetrafluoroborate)
TypeSmall organic molecule
Emp. Form.C20H26N2O5
Mol. Mass.374.4308
SMILESCOC12CC[C@@H](NCC(O)=O)[C@@H]3Oc4c5c(CC1N(C)CC[C@@]235)ccc4O