Reaction Details
TargetKappa-type opioid receptor
LigandBDBM86447
Substrate/Competitorn/a
Ki 28.5±n/a nM
CommentsPDSP_4499
Citation Spetea, MFriedmann, TRiba, PSchütz, JWunder, GLanger, TSchmidhammer, HFürst, S In vitro opioid activity profiles of 6-amino acid substituted derivatives of 14-O-methyloxymorphone. Eur J Pharmacol483:301-8 (2004) 
 
Kappa-type opioid receptor
Name:Kappa-type opioid receptor
Type:G Protein-Coupled Receptor (GPCR)
Mol. Mass.:42692.90
Organism:Rattus norvegicus (rat)
Description:P34975
Residue:380
BDBM86447
NameBDBM86447
Synonyms:(2S)-2-[(4,5alpha-epoxy-3-hydroxy-14beta-methoxy-17-methylmorphinan-6alpha-yl)amino]-3-phenylpropanoic acid bis(tetrafluroborate)
TypeSmall organic molecule
Emp. Form.C27H32N2O5
Mol. Mass.464.5534
SMILESCOC12CC[C@H](N[C@H](Cc3ccccc3)C(O)=O)[C@@H]3Oc4c5c(CC1N(C)CC[C@@]235)ccc4O