Reaction Details
TargetMu-type opioid receptor
LigandBDBM86446
Substrate/Competitorn/a
Ki 0.1±n/a nM
CommentsPDSP_4448
Citation Spetea, MFriedmann, TRiba, PSchütz, JWunder, GLanger, TSchmidhammer, HFürst, S In vitro opioid activity profiles of 6-amino acid substituted derivatives of 14-O-methyloxymorphone. Eur J Pharmacol483:301-8 (2004) 
 
Mu-type opioid receptor
Name:Mu-type opioid receptor
Type:G Protein-Coupled Receptor (GPCR)
Mol. Mass.:44503.11
Organism:Rattus norvegicus (rat)
Description:Competition binding assays were carried out using membrane preparations from transfected HN9.10 cells that constitutively expressed the mu opioid receptor.
Residue:398
BDBM86446
NameBDBM86446
Synonyms:14-O-methyloxymorphone
TypeSmall organic molecule
Emp. Form.C19H23NO4
Mol. Mass.329.3902
SMILESCCOC12CCC(=O)[C@@H]3Oc4c5c(CC1N(C)CC[C@@]235)ccc4O