Reaction Details
TargetBeta-2 adrenergic receptor
LigandBDBM86453
Substrate/Competitorn/a
Ki 2570±n/a nM
CommentsPDSP_4083
Citation Hoffmann, CLeitz, MROberdorf-Maass, SLohse, MJKlotz, KN Comparative pharmacology of human beta-adrenergic receptor subtypes--characterization of stably transfected receptors in CHO cells. Naunyn Schmiedebergs Arch Pharmacol369:151-9 (2004) 
 
Beta-2 adrenergic receptor
Name:Beta-2 adrenergic receptor
Type:n/a
Mol. Mass.:46461.69
Organism:Homo sapiens (Human)
Description:P07550
Residue:413
BDBM86453
NameBDBM86453
Synonyms:CAS_73573-87-2 NSC_3083544
TypeSmall organic molecule
Emp. Form.C19H24N2O4
Mol. Mass.344.4049
SMILESCOc1ccc(CC(C)NCC(O)c2ccc(O)c(NC=O)c2)cc1