Reaction Details
TargetSodium-dependent serotonin transporter
LigandBDBM112777
Substrate/Competitorn/a
Ki 18±n/a nM
CommentsPDSP_1363
Citation Vaishnavi, SNNemeroff, CBPlott, SJRao, SGKranzler, JOwens, MJ Milnacipran: a comparative analysis of human monoamine uptake and transporter binding affinity. Biol Psychiatry55:320-2 (2004) 
 
Sodium-dependent serotonin transporter
Name:Sodium-dependent serotonin transporter
Type:Multi-pass membrane protein
Mol. Mass.:70322.51
Organism:Homo sapiens (Human)
Description:P31645
Residue:630
BDBM112777
NameBDBM112777
Synonyms:NORTRIPTYLINE | US8629135, SW-02
TypeSmall organic molecule
Emp. Form.C19H21N
Mol. Mass.263.3767
SMILES[#6]-[#7]-[#6]-[#6]\[#6]=[#6]-1/c2ccccc2-[#6]-[#6]-c2ccccc-12