Reaction Details
TargetD(1A) dopamine receptor
LigandBDBM86465
Substrate/Competitorn/a
Ki 139±n/a nM
CommentsPDSP_4945
Citation Sit, SYXie, KJacutin-Porte, SBoy, KMSeanz, JTaber, MTGulwadi, AGKorpinen, CDBurris, KDMolski, TFRyan, EXu, CVerdoorn, TJohnson, GNichols, DEMailman, RB Synthesis and SAR exploration of dinapsoline analogues. Bioorg Med Chem12:715-34 (2004) 
 
D(1A) dopamine receptor
Name:D(1A) dopamine receptor
Type:Enzyme Catalytic Domain
Mol. Mass.:49429.75
Organism:RAT
Description:P18901
Residue:446
BDBM86465
NameBDBM86465
Synonyms:(+/-)-7-methyldinapsoline hydrobromide
TypeSmall organic molecule
Emp. Form.C17H17NO2
Mol. Mass.267.3224
SMILESCC1c2cccc3CNC[C@@H](c4ccc(O)c(O)c14)c23