Reaction Details
TargetD(2) dopamine receptor
LigandBDBM86178
Substrate/Competitorn/a
Ki 15±n/a nM
CommentsPDSP_4952
Citation Sit, SYXie, KJacutin-Porte, SBoy, KMSeanz, JTaber, MTGulwadi, AGKorpinen, CDBurris, KDMolski, TFRyan, EXu, CVerdoorn, TJohnson, GNichols, DEMailman, RB Synthesis and SAR exploration of dinapsoline analogues. Bioorg Med Chem12:715-34 (2004) 
 
D(2) dopamine receptor
Name:D(2) dopamine receptor
Type:Cell-surface receptors
Mol. Mass.:50647.10
Organism:Homo sapiens (Human)
Description:P14416
Residue:443
BDBM86178
NameBDBM86178
Synonyms:(+/-)-2-propyldinapsoline hydrobromide | Dinapsoline,(+/-)-N-propyl
TypeSmall organic molecule
Emp. Form.C19H21NO2
Mol. Mass.295.3755
SMILESCCCN1C[C@H]2c3ccc(O)c(O)c3Cc3cccc(C1)c23