Reaction Details
TargetD(2) dopamine receptor
LigandBDBM50117182
Substrate/Competitorn/a
Ki 56±n/a nM
CommentsPDSP_4939
Citation Sit, SYXie, KJacutin-Porte, SBoy, KMSeanz, JTaber, MTGulwadi, AGKorpinen, CDBurris, KDMolski, TFRyan, EXu, CVerdoorn, TJohnson, GNichols, DEMailman, RB Synthesis and SAR exploration of dinapsoline analogues. Bioorg Med Chem12:715-34 (2004) 
 
D(2) dopamine receptor
Name:D(2) dopamine receptor
Type:G Protein-Coupled Receptor (GPCR)
Mol. Mass.:50931.60
Organism:Rattus norvegicus (rat)
Description:P61169
Residue:444
BDBM50117182
NameBDBM50117182
Synonyms:2,3,7,11b-Tetrahydro-1H-dibenzo[de,h]isoquinoline-8,9-diol Dinapsoline, (+/-)
TypeSmall organic molecule
Emp. Form.C16H15NO2
Mol. Mass.253.2958
SMILESOc1ccc2C3CNCc4cccc(Cc2c1O)c34