Reaction Details
TargetNeuronal acetylcholine receptor subunit alpha-2
LigandBDBM10759
Substrate/Competitorn/a
Ki 110±n/a nM
CommentsPDSP_229
Citation Xiao, YKellar, KJ The comparative pharmacology and up-regulation of rat neuronal nicotinic receptor subtype binding sites stably expressed in transfected mammalian cells. J Pharmacol Exp Ther310:98-107 (2004) 
 
Neuronal acetylcholine receptor subunit alpha-2
Name:Neuronal acetylcholine receptor subunit alpha-2
Type:Enzyme
Mol. Mass.:58597.25
Organism:Rattus norvegicus (Rat)
Description:P12389
Residue:511
BDBM10759
NameBDBM10759
Synonyms:2-acetoxyethyl(trimethyl)ammonium;bromide CHEMBL667 [2-(acetyloxy)ethyl]trimethylazanium acetylcholine chloride | cid_6060
TypeSmall Organic Molecule
Emp. Form.C7H16NO2
Mol. Mass.146.2069
SMILESCC(=O)OCC[N+](C)(C)C