Reaction Details
TargetNeuronal acetylcholine receptor subunit alpha-3
LigandBDBM50066789
Substrate/Competitorn/a
Ki 0.47±n/a nM
CommentsPDSP_4117
Citation Xiao, YKellar, KJ The comparative pharmacology and up-regulation of rat neuronal nicotinic receptor subtype binding sites stably expressed in transfected mammalian cells. J Pharmacol Exp Ther310:98-107 (2004) 
 
Neuronal acetylcholine receptor subunit alpha-3
Name:Neuronal acetylcholine receptor subunit alpha-3
Type:Enzyme
Mol. Mass.:56995.52
Organism:Rattus norvegicus (Rat)
Description:P04757
Residue:499
BDBM50066789
NameBDBM50066789
Synonyms:3-((S)-1-Azetidin-2-ylmethoxy)-5-iodo-pyridine A-85380-I | CHEMBL123433
TypeSmall organic molecule
Emp. Form.C9H11IN2O
Mol. Mass.290.1009
SMILESIc1cncc(OC[C@@H]2CCN2)c1