Reaction Details
TargetNeuronal acetylcholine receptor subunit alpha-3
LigandBDBM50100712
Substrate/Competitorn/a
Ki 0.18±n/a nM
CommentsPDSP_4116
Citation Xiao, YKellar, KJ The comparative pharmacology and up-regulation of rat neuronal nicotinic receptor subtype binding sites stably expressed in transfected mammalian cells. J Pharmacol Exp Ther310:98-107 (2004) 
 
Neuronal acetylcholine receptor subunit alpha-3
Name:Neuronal acetylcholine receptor subunit alpha-3
Type:Enzyme
Mol. Mass.:56995.52
Organism:Rattus norvegicus (Rat)
Description:P04757
Residue:499
BDBM50100712
NameBDBM50100712
Synonyms:2-(6-Iodo-pyridin-3-yl)-7-aza-bicyclo[2.2.1]heptane Epibatidine-I,(+/-) | IPH
TypeSmall organic molecule
Emp. Form.C11H13IN2
Mol. Mass.300.1388
SMILESIc1ccc(cn1)C1CC2CCC1N2