Reaction Details
TargetNeuronal acetylcholine receptor subunit alpha-4
LigandBDBM50026220
Substrate/Competitorn/a
Ki>10000±n/a nM
CommentsPDSP_3246
Citation Xiao, YKellar, KJ The comparative pharmacology and up-regulation of rat neuronal nicotinic receptor subtype binding sites stably expressed in transfected mammalian cells. J Pharmacol Exp Ther310:98-107 (2004) 
 
Neuronal acetylcholine receptor subunit alpha-4
Name:Neuronal acetylcholine receptor subunit alpha-4
Type:Enzyme
Mol. Mass.:70196.44
Organism:Rattus norvegicus (Rat)
Description:P09483
Residue:630
BDBM50026220
NameBDBM50026220
Synonyms:2-hydroxy-N,N,N-trimethylethanaminium CHEMBL293410 N-trimethylethanolamine choline | trimethylethanolamine
TypeSmall organic molecule
Emp. Form.C5H14NO
Mol. Mass.104.1702
SMILESC[N+](C)(C)CCO